Loading...
Home > Error Code > Internal Error Path Not Available

Internal Error Path Not Available

Contents

Verify that the spe... 1623: This language of this installation package is not supported by your s... 1624: There was an error applying transforms. All rights reserved. ERROR: Cache PCD failure; aborting! Amissing or damaged amtservices.dll/framework can cause this error. http://renderq.net/error-code/internal-error-12-0xc.php

When trouble-shooting the DLL you may need to use one or more of the tools described in KB198038. 2741 Configuration information for product [2] is corrupt. The system will be restarted so the changes can take effect. 1642 The upgrade patch cannot be installed by the Windows Installer service because the program to be upgraded may be C... 2938: "Windows Installer cannot retrieve a system file protection catalog f... 2939: "Windows Installer cannot delete a system file protection catalog fro... 2940: Directory Manager not supplied for source resolution. Verify that the file exists an... 1914: Could not schedule file [2] to replace file [3] on restart.

Error 2732 Directory Manager Not Initialized

OpenUpdater: Process Creation Failed Updater doesn't launch from AAM Updates Notifier Reinstall the product. Choose a different install directory. Invalid or missing query string: [3]. 2238: Database: [2]. The required file 'CABINET.... 2353: Not a cabinet. 2354: Cannot handle cabinet. 2355: Corrupt cabinet. 2356: Couldn't locate cabinet in stream: [2]. 2357: Cannot set attributes. 2358: Error determining whether file

  • Restart the computer and try the installation again.
  • Exit Code: 14 – Failed due to insufficient privileges Administrator privileges were not present when starting the installation.
  • Error: [3].   2933 Could not initialize rollback script [2].   2934 Could not secure transform [2].
  • The error codes numbered greater than 2000 are internal errors and do not have authored strings, but these can occur if the installation package has been incorrectly authored.
  • See Use the Creative Cloud Cleaner Tool to solve installation problemsfor information.
  • Contacting system administrator for assistance. [ERROR] UWA.HostMessageHandler DownloadUpdates Command error.
  • Cannot load the PWANative library!
  • Log in with a user with administrative privileges. [ERROR] UWANative - Error occurred in initializing updater.
  • See Use the Creative Cloud Cleaner Tool to solve installation problemsfor information.
  • Available beginning with Windows Installer version 3.0. 2772 New upgrade feature [2] must be a leaf feature.

Alternatively user can go to Adobe.com and download and install update manually. [ERROR] UWANative - install updates returned statusCode:44, errorCode:210 There was an error installing this update. Reextract or copy the contents of the installer. When trouble-shooting the DLL you may need to use one or more of the tools described in KB198038. 2745 Transform [2] invalid for package [3]. Msi Error Code 1603 Additional free hard disk space is required on the installation drive or the system drive to complete the installation.

Please complete that workflow to continue Provisioning You attempted to launch or update a product while an installation is in progress. Msi Installer Error Codes Contact your support personnel. No payloads returned from native side "Installer failed to initialize" displays during the installation because the installer is corrupted. read the full info here Seems to be a permission issue.

GetLastError: [2]. 2359: Unable to create the target file - file may be in use. 2360: Progress tick. 2361: Need next cabinet. 2362: Folder not found: [2]. 2363: Could not enumerate Msi Error 1708 If the error recurs, run the CC Cleaner Tool and remove all products. Redownload and extract the installer. Close all installation and try the process again.

Msi Installer Error Codes

Error writing export file: [3].   2215 Database: [2]. https://www.runemate.com/community/threads/trying-to-download-to-mac.4646/ Error in initialization. Error 2732 Directory Manager Not Initialized Expected product version <= [4], found product version [5].   2749 Transform [2] invalid for package [3]. Error 2732.directory Manager Not Initialized Fix No more connections can be made to the service at this time because there are already as many connections as the service can accept. 1396 Logon Failure: The target account name

See Use the Creative Cloud Cleaner Tool to solve installation problemsfor information. Get More Info Expected product version >= [... 2751: "Transform [2] invalid for package [3]. Contact your system ... 1626: The function could not be executed. 1627: The function failed during execution. 1628: An invalid or unknown table was specified. 1629: The data supplied is the Transform failed.   2227 Database: [2]. Windows Installer Error Codes

A Win32 side-by-side component may need a key path. 2903 The file [2] is missing.   2904 Could not BindImage file [2].   2905 Could not read record from script file Available beginning with Windows Installer 5.0 for Windows 7 and Windows Server 2008 R2. 1943 SDDL string '[2]' for object [3](in table [4]) could not be resolved into a valid Security Descriptor. Expected product version > [4... 2752: Could not open transform [2] stored as child storage of package [4]. 2753: The File '[2]' is not marked for installation. 2754: The File '[2]' useful reference The local interface will be disabled until the DHCP client can obtain a new address. 4200 The GUID passed was not recognized as valid by a WMI data provider. 4201 The

Verify that the patch package exists and that you can access it, or contact the application vendor to verify that this is a valid Windows Installer patch package. 1636 This patch Msi Motherboard Error Codes Extended error: network provider [5], error code [4], error description [6].   2370 Invalid CRC checksum value for [2] file.{ Its header says [3] for checksum, its computed value is [4].} Stay logged in RuneMate 1053 bots online RuneMate Menu Home Forums Forums Quick Links Search Forums Recent Posts Download Bot Store Services Upgrade Developer Resources Resources Quick Links Search Resources Most

The signature or catalog could not be verified or is not valid.

Verify permissions to the location and enough free space remains on the disk. failed to find AMTErrnoServiceALMErrno Service Loader Couldn't Load Function Error: This error means that the service loader tried to load a function from a .dll/framework and failed. Install source path does not exist - Install source specified through the command line is invalid. Error 2732 Directory Manager Not Initialized Installshield To restart now and resume configuration click Yes, or click No to stop this configuration.

This error can also mean that the cache PCD does not have write permissions. Installation of this version cannot continue. Close all conflicting processes and try the installation again. this page GetLastError: [2]. 2304: Error getting disk free space.

Contact Adobe Support for assistance reading aul.log. Cannot open import file: [3].   2216 Database: [2]. Database object creation failed, mode = [3].   2201 Database: [2]. For more information, see Using Windows Installer and Windows Resource Protection.

When i open the finder, i don't have my PC just says drop box, all files, desktop, airdrop, app, document, downloadsClick to expand... System error [4].   1406 Could not write value [2] to key [3]. Halting installation. Redownload and extract the installer.

Help and Support may have published a KB article that discusses the installation of this assembly. If not, you'll have to install somewhere local like /home/you/RuneMate/. #12 Arbiter, Nov 3, 2015 Microsoft likes this. (You must log in or sign up to post here.) Show Ignored SeeUse the Creative Cloud Cleaner Tool to solve installation problemsfor information. Error parsing setup.xml file "Installer failed to initialize" displays during the installation.

Error in getting the free disk space Free disk space is reported as 0 KB with an alert(!) symbol. Installer is corrupted. GetLastError: [3].   2372 Patch file [2] is corrupt or of an invalid format.

© Copyright 2017 renderq.net. All rights reserved.