Home > Internal Compiler > Internal Compiler Error Gcc

Internal Compiler Error Gcc


everything.Anyway i keep getting this error:http://pastebin.com/w14BVNALg++: internal compiler error: Killed (program cc1plus)Please submit a full bug report,with preprocessed source if appropriate.See for instructions.make: *** [obj/alert.o] Error 4All dependencys are fine, Format For Printing -XML -Clone This Bug -Top of page Home | New | Browse | Search | [?] | Reports | Help | NewAccount | Log In Remember [x] | configure:3850: $? = 4 configure:3839: gcc -qversion >&5 gcc: error: unrecognized command line option '-qversion' gcc: fatal error: no input files compilation terminated. I uninstalled gcc, installed gcc-4.7, and ... navigate to this website

This > is likely not a GCC bug. In it, you'll get: The week's top questions and answers Important community announcements Questions that need answers see an example newsletter Linked 0 Illegal Instruction error installing cx_oracle with pip 1 Comment 7 Michael Hope 2011-09-05 00:05:23 UTC arm_legitimate_index_p() seems to be wrong. Which Sitecore fields can be rendered using a FieldRenderer Current state of Straus's illumination problem Get first N elements of parameter pack Nest a string inside an array n times How http://www.delorie.com/djgpp/v2faq/faq6_6.html

Internal Compiler Error Killed (program Cc1plus)

So the actual expansion happens on internal representations (Gcc Generic) which is more complex than what you imagine (e.g. Your email will be forwarded to their line manager. If you need more information, please email real-postmaster@arm.com Thank you. And the GCC trunk does report a fatal, but understandable, error.

  1. It could be that a Bash alias in your user profile is the culprit.
  2. What is the meaning of this sentence and why did the Giant rip open his belly?
  3. How much memory do you have?
  4. The name of the assembler program with gcc is just as.
  5. What are the legal consequences for a tourist who runs out of gas on the Autobahn?
  6. Ask Ubuntu works best with JavaScript enabled UbuntuCommunityAsk!DeveloperDesignDiscourseHardwareInsightsJujuShopMore ›AppsHelpForumLaunchpadMAASCanonical current community chat Ask Ubuntu Ask Ubuntu Meta your communities Sign up or log in to customize your list.

A possible cause for the "Abort!" message is that the TMPDIR environment variable points to a non-writable directory. I put the error message in the title. –Raymond Chen May 13 '13 at 17:42 | show 10 more comments 4 Answers 4 active oldest votes up vote 1 down vote Also, make sure you didn't mess up the beginning of the DJGPP.ENV file, where the value of the DJDIR variable is computed (when in doubt, compare it with the stock DJGPP.ENV Comment 8 Bernd Schmidt 2011-09-06 13:11:24 UTC Created attachment 25202 [details] Candidate patch Comment 9 Ramana Radhakrishnan 2011-09-06 16:29:15 UTC Oh fun - I posted a patch about 2 hours after

Related 54C++11 make_pair with specified template parameters doesn't compile0C++ Compilation error(gcc 4.7)46Why does this snippet using uniform initialization compile with g++4.6 but not g++4.7?1Compile errors using std::bind in gcc 4.775Compiling multithread Gcc Internal Compiler Error Segmentation Fault I can't compile it not with g++-4.9 not with clang-3.5 on controller Intel Edison with embedded ubilinux and with only 1 GB of memory and without swap. Environment variable DJGPP is not defined" and then aborts.... Comment 37 StaffLeavers 2014-02-16 13:38:14 UTC greta.yorsh no longer works for ARM.

Your email will be forwarded to their line manager. Comment 1 Richard Biener 2011-04-28 10:03:45 UTC You appearantly ran out of memory and the kernel decided to kill cc1. If you need more information, please email real-postmaster@arm.com Thank you. Illegal instruction. –GKFX May 14 '13 at 16:20 add a comment| up vote 1 down vote accepted Got it!

Gcc Internal Compiler Error Segmentation Fault

The default gcc for 14.04 is 4.8.4; your title mentions gcc-5 but the error messages from the configure script say gcc version 6.1.1 20160511 (Ubuntu 6.1.1-3ubuntu11~14.04.1). Your email will be forwarded to their line manager. Internal Compiler Error Killed (program Cc1plus) Old releases of CWSDPMI could fail like this if an application asks for a large number of small memory chunks. Gcc Internal Compiler Error Killed (program Cc1) If you need more information, please email real-postmaster@arm.com Thank you.

Reload to refresh your session. useful reference I cleared out the end of gcc-4.6 and re-ran sudo apt-get install gcc-4.7 and ... Why mount doesn't respect option ro Bravo For Buckets! Q: During compilation, GCC prints "Fatal: Error in DJGPP installation. Add Swap Space Ubuntu

How much memory do you have? Oh, that's possible I guess. Does not exist in 4.5.3. my review here Your email will be forwarded to their line manager.

Why do central European nations use the color black as their national colors? Here a smaller test case that seems related. > cat tst2.c typedef signed char int8_t ; typedef signed short int16_t; typedef signed long int32_t; typedef signed long long int64_t; // doesn't Something inside filter/hq2x.cpp is causing GCC to go nuts and consume memory & swap, so I wouldn't be at all surprised if it triggers a fatal error on a Pi.

Related 0gcc compiling error for c++ program0Error while compiling c program using gcc thru the CLI1diff between x86_64-linux-gnu-gcc and plain old gcc?1C compiler cannot create excecutables0How to install an 'ansi

Keyboard shortcut to search for text in MS Outlook 2007 How to DM a no-equipment start when one character needs something specific? Your email will be forwarded to their line manager. more hot questions question feed about us tour help blog chat data legal privacy policy work here advertising info mobile contact us feedback Technology Life / Arts Culture / Recreation Science Remove pool_range attribute. (arm_zero_extendhisi2, arm_zero_extendhisi2_v6, arm_zero_extendqisi2, arm_zero_extendqisi2_v6, thumb1_zero_extendqisi2_v6): Remove pool_range and neg_pool_range attributes. * config/arm/thumb2.md (thumb2_zero_extendsidi2, thumb2_zero_extendhidi2, thumb2_zero_extendqidi2, thumb2_extendsidi2, thumb2_extendhidi2, thumb2_extendqidi2): Delete.

clang: note: diagnostic msg: PLEASE ATTACH THE FOLLOWING FILES TO THE BUG REPORT: Preprocessed source(s) and associated run script(s) are located at: clang: note: diagnostic msg: /tmp/math_wrap-5b42de.cpp clang: note: diagnostic msg: ill keep you posted. .█████KOMODOICO STARTS OCTOBER 15TH▄██▄▄████████▄▄████████████▄█████▀▄▄▄▄▀█████████▌▄▄▄██▄▄▄▐██████████▄██████▄██████████████████████████████▐███████████████████████████████████████████▀██████▀██████████▌▀▀▀██▀▀▀▐█████████▄▀▀▀▀▄█████▀████████████▀▀████████▀▀██▀.PROTECTING YOUR PRIVACY WITH BITCOIN'S HASHRATE.█████.Untraceable Zero Knowledge Transactions Delayed Proof of Work / as safe as Bitcoin.█████ vual Hero Member Offline Activity: 658 asked 3 years ago viewed 2901 times active 1 year ago Blog Stack Overflow Podcast #91 - Can You Stump Nick Craver? http://renderq.net/internal-compiler/internal-compiler-error-net.php The fix was to do the following:Code:freedd if=/dev/zero of=/var/swap.img bs=1024k count=1000mkswap /var/swap.imgswapon /var/swap.imgfreemake -f makefile.unixRegardless of what the first poster said.

Numenta member breznak commented Feb 4, 2015 @rhyolight cool detective work! 👍 added mention to the wiki https://github.com/numenta/nupic/wiki/Installing-NuPIC-on-Ubuntu Numenta member rhyolight commented Feb 4, 2015 Thanks, Marek! Couldn't compile a client to save my life. The recursion depth is small, otherwise it would hit the 512 depth limit. Finding Signs of Life from afar Is it illegal for regular US citizens to possess or read the Podesta emails published by WikiLeaks?

Could you try to invoke gcc using this more explicit command?/usr/bin/gcc sourcefile.c -o helloworld. A: The fatal error message about DJGPP not being defined means just that--that your DJGPP environment variable is not defined. Make sure you're only compiling one file at a time.

© Copyright 2017 renderq.net. All rights reserved.