Loading...
Home > Internal Compiler > Internal Compiler Error In Dwarf2out Finish At Dwarf2out.c

Internal Compiler Error In Dwarf2out Finish At Dwarf2out.c

See for instructions. Compiling Thunderbird 17.0.2 on Debian Testin... 325. symbolic debug info), by setting the parameter < 0. Collection of errors when compiling kernel 3.... 318. my review here

If we pass a String > in, the size of b is known in advance. So for it to be effective one would need to preserve #include directives and reduce headers together with sources (ugh). 12 « Return to gcc - bugs | 1 view|%1 views array parameters are normally just pointers, but for templates it's not necessarily true! incomplete_types_list needs to be a vec *because we want to tell the garbage collector about it. */ static GTY(()) vec *incomplete_types; /* A pointer to the base of a https://gcc.gnu.org/bugzilla/show_bug.cgi?id=56234

Comment 1 KISHIMOTO, Makoto 2006-03-30 18:19:53 EST The code is minimal fragment to reproduce the problem in SpiderMonkey. ( http://bonsai.mozilla.org/cvsblame.cgi?file=mozilla/js/src/jscpucfg.c&rev=3.25#255 ) When compile this, with options "-O0 -g -c", cause the The bug is not reproducible, so it is likely a hardware or OS problem. This gets called *after* the epilogue code has been generated. */ void dwarf2out_end_epilogue (unsigned int line ATTRIBUTE_UNUSED, const char *file ATTRIBUTE_UNUSED) { dw_fde_ref fde; char label[MAX_ARTIFICIAL_LABEL_BYTES]; last_var_location_insn = NULL; cached_next_real_insn = make[6]: *** [drivers/net/wireless/ath/ath9k/ar5008_phy.o] Error 1 make[6]: *** Waiting for unfinished jobs....

  • public VOID file /tmp/test2.ii line 3256 col 17 align 8 context > (gdb) call lookup_type_die (context) $1 = (struct die_struct *) 0x7ffff58fdd70 (gdb) call debug_tree (node->created_for)
  • The bug is not reproducible, so it is likely a hardware or OS problem.
  • We must emit this label if it might be used. */ if (!do_frame && (!flag_exceptions || targetm_common.except_unwind_info (&global_options) == UI_SJLJ)) return; fnsec = function_section (current_function_decl); switch_to_section (fnsec); ASM_GENERATE_INTERNAL_LABEL (label, FUNC_BEGIN_LABEL, current_function_funcdef_no);
  • Comment 11 Chris Dumez 2016-02-22 10:38:01 PST Comment on attachment 271923 [details] Patch Ok to unbreak you and because equalIgnoringASCIICase() has a literal taking an override.

I will look deeper tomorrow. It was meant to be off (without the quotes), referring > to the local off variable. Compiling samba 4.0.0 on Debian Testing/Wheez... 316. Die if we exceed one uleb128 byte. */ gcc_assert (size_of_uleb128 (augmentation_size) == 1); } } dw2_asm_output_nstring (augmentation, -1, "CIE Augmentation"); if (dw_cie_version >= 4) { dw2_asm_output_data (1, DWARF2_ADDR_SIZE, "CIE Address Size");

Increasing the cache 4-fold doesn't help. The CFA register and offset, which may change during the course of the function, are used to calculate its value at runtime. Home | New | Search | [?] | Reports | Requests | Help | NewAccount | Log In [x] | Forgot Password Login: [x] | Report Bugzilla Bug Legal [email protected] Discussion: http://gcc-bugs.gcc.gnu.narkive.com/doKfLqOh/bug-c-29650-new-internal-compiler-error-in-dwarf2out-finish-at-dwarf2out-c-14129 fs/reiserfs/bitmap.c: In function 'scan_bitmap_block.constprop.9': fs/reiserfs/bitmap.c:236:9: warning: 'next' may be used uninitialized in this function [-Wmaybe-uninitialized] make[1]: *** [drivers] Error 2 make[1]: *** Waiting for unfinished jobs....

Home | New | Browse | Search | [?] | Reports | Requests | Help | NewAccount | Log In [x] | Forgot Password Login: [x] OSDev.orgThe Place to Start for make[3]: *** [net/xfrm/xfrm_sysctl.o] Error 1 make[2]: *** [net/xfrm] Error 2 make[1]: *** [net] Error 2 make: *** [debian/stamp/build/kernel] Error 2 Kernel 3.7 with -O0 on AMD FX 8150 exec make kpkg_version=12.036+nmu3 This is the output: | gcc -c -isystem/home/koan/devel/build/angstrom/tmp/sysroots/x86_64-linux/usr/include -O2 -g -DIN_GCC -DCROSS_DIRECTORY_STRUCTURE -W -Wall -Wwrite-strings -Wcast-qual -Wstrict-prototypes -Wmissing-prototypes -Wmissing-format-attribute -pedantic -Wno-long-long -Wno-variadic-macros -Wno-overlength-strings -Wold-style-definition -Wc++-compat -DHAVE_CONFIG_H -I. -I. -I/home/koan/devel/build/angstrom/tmp/work/armv5te-angstrom-linux-gnueabi/gcc-cross-initial-4.5-r36.1+svnr170880/gcc-4_5-branch/gcc -I/home/koan/devel/build/angstrom/tmp/work/armv5te-angstrom-linux-gnueabi/gcc-cross-initial-4.5-r36.1+svnr170880/gcc-4_5-branch/gcc/. -I/home/koan/devel/build/angstrom/tmp/work/armv5te-angstrom-linux-gnueabi/gcc-cross-initial-4.5-r36.1+svnr170880/gcc-4_5-branch/gcc/../include It'd be reasonable to accept the patch (it's a one-liner that adds support for a new compiler) or reject it (it's a workaround for a compiler we technically don't support anymore),

A non-optimial patch for the above is (non-optimal because it does not include hashing) Index: gcc/gimple.c =================================================================== --- gcc/gimple.c (revision 182525) +++ gcc/gimple.c (working copy) http://lists.openembedded.org/pipermail/openembedded-devel/2011-May/078343.html Here's what I have thus far: % patch -p0 < patch patching file Makefile patching file test2.ii patching file test.ii % make gcc -r -nostdlib test2.ii test.ii -w -std=gnu++0x -pipe -g Poison these here until it can be done generically. Though we should be hitting the gimple_type_leader cache only ...

They've been totally replaced in this file; make sure it stays that way. */ #undef DWARF2_UNWIND_INFO #undef DWARF2_FRAME_INFO #if (GCC_VERSION >= 3000) #pragma GCC poison DWARF2_UNWIND_INFO DWARF2_FRAME_INFO #endif /* The size http://renderq.net/internal-compiler/internal-compiler-error-in-mem-loc-descriptor-at-dwarf2out-c.php Version: WebKit Local Build Platform: Unspecified Unspecified Importance: P2 Normal Assigned To: Nobody URL: Keywords: Depends on: Blocks: Show dependency tree /graph Reported: 2016-02-22 08:06 PST by Konstantin Tokarev Burning audio CDs from the command line in de... 306. Compiling ECCE 6.4 on Debian Testing 324.

Comment 3 Konstantin Tokarev 2016-02-22 09:13:56 PST What FIXME do you mean? Installing GNU Octave on Windows XP This is a Windows XP post (my first?), so right-thinking linux people can move on. See for instructions. get redirected here asm_written used nonlocal VOID file /tmp/test.ii line 2611 col 51 align 1 context so it's DECL_CONTEXT is a type from a different TU.

data_section : readonly_data_section); #endif /* EH_FRAME_SECTION_NAME */ } switch_to_section (eh_frame_section); #ifdef EH_FRAME_THROUGH_COLLECT2 /* We have no special eh_frame section. lto1: internal compiler error: in dwarf2out_finish, at dwarf2out.c:22501 Please submit a full bug report, with preprocessed source if appropriate. uniquify_nodes: : /* Second fixup all trees in the new cache entries. */ : for

make: *** [debian/stamp/build/kernel] Error 2 Error messages when compiling kernel 3.7 on AMD FX 8150 with -O2 or -O1 exec make kpkg_version=12.036+nmu3 -f /usr/share/kernel-package/ruleset/minimal.mk debian INITRD=YES exec debian/rules INITRD=YES kernel_image kernel_headers

Instead testing a similar > > Index: gcc/lto/lto.c > =================================================================== > --- gcc/lto/lto.c (revision 182525) > +++ gcc/lto/lto.c (working copy) > @@ -845,6 +845,14 @@ equalLettersIgnoringASCIICase(..., "off") where "off" is literal is used in many other places of this file, and I guess this form is a bit faster because literal needs not need is8Bit() check. See for instructions. The bug is not reproducible, so it is likely a hardware or OS problem.

Closing bug. Did the build eventually finish? It was meant to be off (without the quotes), referring to the local off variable. useful reference make[2]: *** [drivers/staging] Error 2 make[2]: *** [drivers/net] Error 2 In file included from include/linux/genhd.h:65:0, from include/linux/blkdev.h:9, from include/scsi/scsi_cmnd.h:5, from drivers/scsi/sym53c8xx_2/sym_glue.h:58, from drivers/scsi/sym53c8xx_2/sym_hipd.c:44: include/linux/fs.h:1550:49: internal compiler error: Segmentation fault Please submit

Factor out common prologue sequences into multiple CIEs. */ /* The first part of this file deals with the DWARF 2 frame unwind information, which is also used by the GCC Further, the assembler can't handle any of the weirder relocation types. */ if (enc & DW_EH_PE_indirect) ref = dw2_force_const_mem (ref, true); fprintf (asm_out_file, "\t.cfi_personality %#x,", enc); output_addr_const (asm_out_file, ref); fputc ('\n', Derived from DWARF 1 implementation of Ron Guilmette ([email protected]). make[6]: *** [/tmp/ccQIIdf5.ltrans8.ltrans.o] Error 1 lto1: internal compiler error: in dwarf2out_finish, at dwarf2out.c:22501 Please submit a full bug report, with preprocessed source if appropriate.

© Copyright 2017 renderq.net. All rights reserved.