Loading...
Home > Internal Compiler > Internal Compiler Error In Pop_scope At C-decl.c

Internal Compiler Error In Pop_scope At C-decl.c

Hunk #2 succeeded at 246 (offset 8 lines). My computer is configured exactly the way the LFS book (6.4) says. I couldnt figure out >> what this error means. >> My stack operations are nested properly. (in fact, one of the >> programs complied without any problems earlier). >> >> Can I haven't tried what your doing but if you changed the .config file from what was orginally, ie cut and paste, replace, etc., then you will get that error. http://renderq.net/internal-compiler/internal-compiler-error-in-make-rtl-for-nonlocal-decl-at-cp-decl-c.php

If there is a compiler problem it will be fixed by people who know that code. They hope these examples will help you to get a better understanding of the Linux system and that you feel encouraged to try out things on your own. So wehre wud i find the compiler sources? Format For Printing -XML -Clone This Bug -Top of page Home | New | Browse | Search | [?] | Reports | Help | NewAccount | Log In Remember [x] | why not try these out

Offline #6 2005-04-29 22:00:42 whargoul Member From: Odense, Denmark Registered: 2005-04-04 Posts: 546 Re: Ati with kernel26. done.Length: 37,099,602 (unauthoritative)100%[====================================>] 37,099,602 67.37K/s ETA 00:0022:46:05 (64.46 KB/s) - `linux-2.6.11.7.tar.bz2' saved [37099602]==> Found config in build dir==> Found logo_linux_clut224.ppm in build dir==> Downloading acpi-20050228-2.6.11.diff.bz2--22:46:05-- http://ftp.kernel.org/pub/linux/kernel/ Please could you again give me some hint ?

  1. If yes, you need to replace its md5sum in the PKGBUILD.
  2. Board footer Jump to Newbie Corner Installation Kernel & Hardware Applications & Desktop Environments Laptop Issues Networking, Server, and Protection Multimedia and Games System Administration Other Architectures Announcements, Package & Security
  3. cp ../logo_linux_clut224.ppm drivers/video/logo/ # get rid of the 'i' in i686 carch=`echo $CARCH | sed 's|i||'` cat ../config | sed "s|#CARCH#|$carch|g" >./.config # build the full kernel version to use in
  4. If you type "make bootstrap" 3 times in a row, do you get the exact same failure every time?
  5. Did you modify the config file?
  6. Aborting... [[email protected] kernel26]# Arch - It's something refreshing Offline Pages: 1 Index ¬ĽKernel & Hardware ¬ĽAti with kernel26.
  7. make[3]: *** [libgcc/./_gcov_merge_add.o] Erreur 1 make[3]: Leaving directory `/usr/src/gcc-cvs/objdir/gcc' make[2]: *** [libgcc.a] Erreur 2 make[2]: Leaving directory `/usr/src/gcc-cvs/objdir/gcc' make[1]: *** [stage2_build] Erreur 2 make[1]: Leaving directory `/usr/src/gcc-cvs/objdir/gcc' make: *** [bootstrap-lean] Erreur

Please visit this page to clear all LQ-related cookies. Comment 2 Jean-Marc Vanel 2004-08-20 08:14:20 UTC Subject: Re: internal compiler error in pop_scope pinskia at gcc dot gnu dot org wrote: >------- Additional Comments From pinskia at gcc dot gnu Seriouly, how can I check my hardware ? Hint :configure your browser Monospace font in the Preferences.

So wehre wud i find the compiler > sources? Actually, the problem "solution by self"! See for instructions. Today, after I turned it on, I tried to compile again.

Passed acpi-20050228-2.6.11.diff.bz2 ... Registration is quick, simple and absolutely free. done. ==> RETR linux-2.6.11.7.tar.bz2 ... Passed acpi-dsdt-initrd-patch-v0.7d-2.6.9.patch ...

Find More Posts by Nathanael 12-20-2006, 03:08 PM #3 Mithrilhall Member Registered: Feb 2002 Location: Massachusetts Distribution: Debian (Lenny) Posts: 286 Original Poster Rep: Link to config file: .config Visit the following links: Site Howto | Site FAQ | Sitemap | Register Now If you have any problems with the registration process or your account login, please contact us. ar rc ./libgcc.a libgcc/./_muldi3.oS libgcc/./_negdi2.oS libgcc/./_lshrdi3.oS libgcc/./_ashldi3.oS libgcc/./_ashrdi3.oS libgcc/./_cmpdi2.oS libgcc/./_ucmpdi2.oS libgcc/./_floatdidf.oS libgcc/./_floatdisf.oS libgcc/./_fixunsdfsi.oS libgcc/./_fixunssfsi.oS libgcc/./_fixunsdfdi.oS libgcc/./_fixdfdi.oS libgcc/./_fixunssfdi.oS libgcc/./_fixsfdi.oS libgcc/./_fixxfdi.oS libgcc/./_fixunsxfdi.oS libgcc/./_floatdixf.oS libgcc/./_fixunsxfsi.oS libgcc/./_fixtfdi.oS libgcc/./_fixunstfdi.oS libgcc/./_floatditf.oS libgcc/./_clear_cache.oS libgcc/./_enable_execute_stack.oS libgcc/./_trampoline.oS libgcc/./__main.oS libgcc/./_absvsi2.oS libgcc/./_absvdi2.oS Search this Thread 12-20-2006, 02:30 PM #1 Mithrilhall Member Registered: Feb 2002 Location: Massachusetts Distribution: Debian (Lenny) Posts: 286 Rep: Problem compiling kernel I've downloaded the vanilla kernel linux-2.6.18.6.tar.gz

Bug198295 - drivers/mtd/maps/netsc520.mod.c:36: internal compiler error: in pop_scope, at c-decl.c:855 Summary: drivers/mtd/maps/netsc520.mod.c:36: internal compiler error: in pop_scope, at... this page Do what I told you: makepkg -g >>PKGBUILD It will put the new md5sum list at the bottom of the PKGBUILD. See for instructions. Introduction to Linux - A Hands on Guide This guide was created as an overview of the Linux Operating System, geared toward new users as an exploration tour and getting started

Arch - It's something refreshing Offline #7 2005-04-30 13:38:19 whargoul Member From: Odense, Denmark Registered: 2005-04-04 Posts: 546 Re: Ati with kernel26. The key thing to check is whether the bugs are reproducible. Thanks for your attention! get redirected here The compiler > is crashing while parsing the source file. > > The other instructions emitted in that error message are basically > "File a bug, with preprocessed source if possible."

But when i try to make my new kernel I gets this error:[[email protected] kernel26]# makepkg==> Making package: kernel26 (Fri Apr 29 22:52:36 CEST 2005)==> Checking Runtime Dependencies...==> Checking Buildtime Dependencies...==> Retrieving I don't know if there are free programs for this. The compiler is crashing while parsing the source file.

If yes, you need to replace its md5sum in the PKGBUILD.Snowman beat me this time!

See for instructions. Make simple changes and see whether the problem goes away. Logged in!==> SYST ... Good luck. ;-) Larry > > > > On 10/10/06, David A Rowland wrote: At > 7:40 PM -0700 10/10/06, Gargi wrote: >> Well, I am having a problem with

This looks like a failure at compile-time because of a > problem in the compiler. Also, what gcc version? Home | New | Search | [?] | Reports | Requests | Help | NewAccount | Log In [x] | Forgot Password Login: [x] | Report Bugzilla Bug Legal Error while useful reference And since I am relativel new to xcode and OpenGL, i dont know where to go about looking for ths error.

Format For Printing -XML -Clone This Bug -Top of page First Last Prev Next This bug is not in your last search results. This probably isn't the right group to ask about detecting hardware problems. make[3]: *** [httppoller.o] Error 1 make[3]: Leaving directory `/tmp/zabbix-2.0.9/src/zabbix_server/httppoller' make[2]: *** [install-recursive] Error 1 make[2]: Leaving directory `/tmp/zabbix-2.0.9/src/zabbix_server' make[1]: *** [install-recursive] Error 1 make[1]: Leaving directory `/tmp/zabbix-2.0.9/src' make: *** [install-recursive] Error Daniel.

Allright I try. Source Code Try these examples: int (*(*foo)(void ))[3] declare bar as volatile pointer to array 64 of const int cast foo into block(int, long long) returning double cdecl C gibberish Comment 7 Jean-Marc Vanel 2004-08-20 16:40:11 UTC Subject: Re: internal compiler error in pop_scope pinskia at gcc dot gnu dot org wrote: >------- Additional Comments From pinskia at gcc dot gnu

© Copyright 2017 renderq.net. All rights reserved.