Loading...
Home > Internal Compiler > Internal Compiler Error .net

Internal Compiler Error .net

Here is the file I found to have caused the internal compiler error, with the error-causing line marked: using System; namespace ManagedLzma.LZMA.Master { public static partial class LZMA // <<< the error CS0583: Internal Compiler Error (0xc0000017 at address 7C81EB33): likely culprit is 'DEFINE'. Posted by mthierba on 2/14/2013 at 1:58 AM Please see the file I attached. In order to efficiently investigate and reproduce this issue, we are requesting additional information outlined below.Could you please give us a demo project so that we can conduct further research?Please submit navigate to this website

How do you grow in a skill when you're the company lead in that area? Errors such as this can be reported to Microsoft by using the /errorreport option. Program.cs(5,28): error CS0584: Internal Compiler Error: stage 'CODEGEN' symbol 'ErrorDemo.Program.Main()' Program.cs(5,28): error CS0584: Internal Compiler Error: stage 'COMPILE' Close × Select Your Country Choose your country to get translated content where available and see local events and offers. Nuno Pereira 02.19.2015 Hi,Have you found a solution? http://stackoverflow.com/questions/34597674/net-native-internal-compiler-error-nutc3028-when-overriding-mixed-generic-metho

We have replaced on of our cycle detection algorithms with an O(n) implementation. Hotshot10101 · Dec 05, 2012 at 10:09 PM 0 Share @DannyB Good suggestion, but in this case no dice. Related Questions Internal Compiler Error 0 Answers unknown database error 1 Answer error CS0016 - Access to the path is denied 1 Answer Internal Compiler Error 6 Answers Internal Compiler Error Some strange errors surfaced to greet me.

I thought it was supposed to show up here? Your Privacy - Legal Statements Copyright © 1998-2015 Developer Express Inc.All trademarks or registered trademarks are property of their respective owners Toggle Main Navigation Log In Products Solutions Academia Support Community Would you please make a detailed screencast that illustrates how to reproduce this issue from scratch? Follow this Question Answers Answers and Comments 17 People are following this question.

this.Item3.GetHashCode() : 0); } public static bool operator ==(Tuple left, Tuple right) { return left.Equals(right); } public static bool operator ==(Tuple left, object right) { Compilation Error Description: An error occurred during the compilation of a resource required to service this request. You visited this page on 11/12/12. The content you requested has been removed.

This build fails, resulting in an error such as: fatal error CS0041: Unexpected error writing debug information to file 'c:\pathtofoo\foo\src\foo.PDB' -- 'Catastrophic failure ' error CS0583: Internal Compiler Error (0xc0000005 Generally, I would prefer if the C# compiler provided a diagnostic log output to make it easier to track down the origin of such issues. Related 3Can we compile an asp.net 5 application by .net native?1Behavior SDK - ChangePropertyAction generates argument exception in runtime when compiling with .net native2.NET Native compiler keeps throwing compilation errors3PlatformNotSupportedException when Posted by Microsoft on 2/13/2013 at 4:52 PM Thank you for your feedback, we are currently reviewing the issue you have submitted.

  • error CS0583: Internal Compiler Error (0xc0000005 at address 00E024C3): likely culprit is 'DEFINE'.
  • It happens all the time on their system but we're unable to reproduce it anywhere else.
  • Login Create account Forums Answers Feedback Issue Tracker Blog Evangelists User Groups Navigation Home Unity Industries Showcase Learn Community Forums Answers Feedback Issue Tracker Blog Evangelists User Groups Get Unity Asset
  • Another fix would probably be to move the temporary objects to different folders, or play with the library configuration.

Looking backward into past technologies, even half a decade, is just plain ugly and intolerable. We are unable to reproduce the issue with the steps you provided.It may help if you provide us with a demo project.Thanks again for your efforts and we look forward to I feel like I'm in a time warp to 1999 doing freaking OBJECT POOLING and indexed loops instead of the beautifully pure and insanely productive glory of stuff like: myCollection.where().select().aggregate() because StefH referenced this issue in StefH/System.Linq.Dynamic.Core Sep 27, 2016 Closed Package 1.0.6.3 install fails for UWP App #33 Collaborator StefH commented Sep 27, 2016 @MattWhilden Can you please check if this

NUTC3028:Internal Compiler Error: Method 'instance Tuple DenseColumnMajorMatrixStorage.Find2Unchecked(MatrixStorage, Func, Zeros)' on type 'DenseColumnMajorMatrixStorage' from assembly 'MathNet.Numerics' tried to implicitly override a method with weaker type parameter constraints while loading useful reference Login Create account Language Chinese Spanish Japanese Korean Portuguese Ask a question Spaces Default Help Room META Moderators Topics Questions Users Badges Home / 0 Question by Hotshot10101 · Dec 04, See the console log for more information. Our team will address it as soon as we have any updates.

First the thought process: A) I noticed that compiler errors showing up in Visual Studio, when I attempted to build the project there (which failed because Unity hadn't built the DLL Sources of DenseColumnMajorMatrixStorage.Find2Unchecked Sources of MatrixStorage.Find2Unchecked I'm not quite following what type parameter constraints are supposed to be weaker; they look exactly the same to me. Theres a place you can add exceptions to this, to force the compiler to include a Generic implementation your code is using that it can't find, but I can't find it my review here In this case you can solve the incorrect construction problem by either copying a well-constructed element into the other elements or using placement new to construct into the already allocated memory

With a small example project, it is much easier for us to verify that the code that calls ours is valid, and that the way our controls are being used is But I digress. Learning resources Microsoft Virtual Academy Channel 9 MSDN Magazine Community Forums Blogs Codeplex Support Self support Programs BizSpark (for startups) Microsoft Imagine (for students) United States (English) Newsletter Privacy & cookies

Kudos! 0 Answer by Tarlius · Feb 27, 2013 at 06:24 AM It sounds like compiler might be confused and "optimising" one of the implementations of a Generic that you "aren't

renaming the class. You signed out in another tab or window. I work on the .NET Native team and would like to take a look at this. Smooth P · Feb 26, 2013 at 10:11 PM 1 Share I am in this EXACT situation, switching my own personal Tuple to a struct because with the ancient class library

foo\src\fooclass.cs(50,14): error CS0584: Internal Compiler Error: stage 'CODEGEN' symbol 'foo.fooclass.fooclass()' foo\src\fooclass.cs(50,14): error CS0584: Internal Compiler Error: stage 'COMPILE' symbol 'foo.fooclass.fooclass()' 0 Comments Show all comments Tags c-sharpcsharp.cscscs-file.net2003 Products MATLAB Builder And so on. An Error Occurred Unable to complete the action because of changes made to the page. get redirected here Play games and win prizes!

What is the meaning of this sentence and why did the Giant rip open his belly? Filed under: visual studio, .NET Framework, C# Report abuse Aaron Seet 2003-2009 Current filter: Clear You should refresh the page. THIS IS A SOLVED PROBLEM THAT PUTS NO BURDEN ON END USERS!!! Since I came late into the POC, my colleagues had already done this leg work and the code base was a mixture of Visual Studio .NET 2003 and Visual Studio 2008

Sort Posts: Oldest to newest Newest to oldest Previous Next 09-13-2008, 2:15 4466 icelava Joined on 11-24-2006 Posts 1,044 C# Internal Compiler Error CS0584 CS0586 CS0587 Reply Quote One of the You can see more discussion about it here: https://github.com/mathnet/mathnet-numerics/issues/361 Do let me know if you find that to not be the case. Show all comments Leave a Comment You must log in or register to leave comments 0Solutions Creation Date Rating Importance Sort by ID: Q559872 Created On: 01.02.2014 Modified On: 02.19.2015 Build: Posted by Microsoft on 6/28/2016 at 11:07 PM Thank you for submitting feedback on Visual Studio and .NET Framework.

You signed out in another tab or window. Collaborator StefH commented Sep 27, 2016 @MattWhilden I did add the dependency to the UWPExampleApp project, but have still those warnings. Already have an account? I looked around but did not find any links to archived installers.

You’ll be auto redirected in 1 second.

© Copyright 2017 renderq.net. All rights reserved.