Loading...
Home > Internal Compiler > Internal Compiler Error Segmentation Fault Xcode 4

Internal Compiler Error Segmentation Fault Xcode 4

Contents

Strange... So the command sudo apt-get install --reinstall gcc gcc-4.8 gcc-4.8-base libgcc1 cpp-4.8 did the trick –Amadu Bah Jun 1 '14 at 10:36 add a comment| Your Answer draft saved draft Where are sudo's insults stored? Discussion Akira Tamamori - 2013-01-21 Thank you for using SPTK and reporting this problem. http://renderq.net/internal-compiler/internal-compiler-error-segmentation-fault-xcode.php

You'll have to reinstall the plain GCC packages to properly reinstall all gcc binaries. Should a spacecraft be launched towards the East? compilation aborted for List_manip.f90 (code 3) You'll notice that the files are still pretty extensive, as I did not manage to reproduce the segfault when removing much more. Jim Dempsey Hi Jim, thank you very much for your hint; that indeed fixed the compiler segfault.

Gcc Internal Compiler Error Segmentation Fault

They are not exempt. Can an umlaut be written as line (when writing by hand)? I just installed xcode 3.2.4 When compiling several times I have run into the following: internal compiler error: Segmentation fault The full message is below. Peter Brommer Top Steve Lionel (Intel) Tue, 05/03/2011 - 08:36 Fortran has no reserved words.

  • As you said, it fails with: newlib/libc/machine/arm/setjmp.S:83:26: pasting "_" and "\" does not give a valid preprocessing token The main.log you attached to this ticket was made with llvm-gcc-4.2.
  • Try apt-get reinstall gcc gcc-4.6 gcc-4.6-base libgcc1.
  • Download in other formats: Comma-delimited Text Tab-delimited Text RSS Feed 404 Category not found Oh My Gosh!
  • I don't really see a purpose to filing a bug report for a version for which no more updates are planned.
  • That solved the problem!
  • My workstation is a OSX 10.10 machine, and I have a personal computer with Windows 10.
  • Hint :configure your browser Monospace font in the Preferences.
  • As it did not help, here is the output of apt-cache policy gcc-4.6: gcc-4.6: Installed: 4.6.3-1ubuntu5 Candidate: 4.6.3-1ubuntu5 Version table: *** 4.6.3-1ubuntu5 0 500 http://il.archive.ubuntu.com/ubuntu/ precise/main amd64 Packages 100 /var/lib/dpkg/status and
  • Same result as gcc. –Yuval F Jun 26 '13 at 9:00 1 "I tried reinstalling build-essential" - That's just a metapackage.
  • I now think you mean /usr/lib/gcc/x86_64-linux-gnu/4.6/cc1 from the cpp-4.6 package - was it absent?

UbuntuCommunityAsk!DeveloperDesignDiscourseHardwareInsightsJujuShopMore ›AppsHelpForumLaunchpadMAASCanonical current community chat Ask Ubuntu Ask Ubuntu Meta your communities Sign up or log in to customize your list. share|improve this answer answered Nov 13 '12 at 18:02 Armen Tsirunyan 76.5k32216345 Yes, I agree that should be fixed. Green (Intel) Which version of Xcode? Internal Compiler Error Segmentation Fault Please Submit A Full Bug Report make[2]: *** [delta.o] Error 1 make[1]: *** [all-recursive] Error 1 make: *** [all-recursive] Error 1 If I remove the delta section from the makefile SPTK compiles successfully so it should be

And as 11.1.088 has issues with the Xcode version installed here (see http://software.intel.com/en-us/forums/showthread.php?t=73942), I will try my luck with the 12.0 compiler. ron Top staghind Mon, 04/25/2011 - 00:00 Each time a description of the change, there is always plenty to talk about around the world. For me to reproduce this, I need: Xcode version?Mac OS X version? Now I get this message when I try to compile: gcc: internal compiler error: Segmentation fault (program cc1) Compiling the same program with g++ works fine.

I created a new CB project and added the right addons and source files, and the compiler fails with a segmentation fault in a strange location, that does not appear when Could you try to invoke gcc using this more explicit command?/usr/bin/gcc sourcefile.c -o helloworld. Ask Ubuntu works best with JavaScript enabled cocoa xcode cocoa xcode Internal compiler error: Segmentation Fault Brian O'Brien Internal compiler error: Segmentation Fault Apr 21 2006, 20:20 /usr/include/gcc/darwin/4.0/c++/cstring:101: internal compiler When is it okay to exceed the absolute maximum rating on a part?

Internal Compiler Error Segmentation Fault Android

Please don't fill out this field. https://sourceforge.net/p/sp-tk/bugs/68/ if statement - short circuit evaluation vs readability Flour shortage in baking Does anyone know this encoding? Gcc Internal Compiler Error Segmentation Fault The compiler should be able to disambiguate your type name map with the reserve word map provided that "use new_types" is used or not used according to how you want to C++: Internal Compiler Error: Segmentation Fault (program Cc1plus) Opencv That seemed to work fine.

Previous company name is ISIS, how to list on CV? useful reference Before hand though I used the Apple transfer mode to move everything over from the old laptop to the new. My recent 12.0 Mac compiler and Xcode 4 compile this just fine, as does my Linux system with the 11.1 compiler built onthe same date as yours,20100806. You said you're on Xcode 4.2; 4.3.3 has been available for a month already. Libgcc Internal Compiler Error Segmentation Fault

Current state of Straus's illumination problem Working without compensation, what to do? And which version of Mac OS X. Thank you. –Olaf Dietsche Nov 13 '12 at 18:12 add a comment| Your Answer draft saved draft discarded Sign up or log in Sign up using Google Sign up using my review here What is the exchange interaction?

Steve - Intel Developer Support Top jimdempseyatthecove Wed, 04/27/2011 - 06:01 In your test program you have a type named "map"Can you rename this to a different name "myMap" then replace But I believe that the error is resulting from something happening in the << overloaded operator. I understand that I can withdraw my consent at any time.

ron Top pbro Tue, 05/03/2011 - 12:57 Ron, thanks for your reply.

So we consider that and newer versions 'safe'. Linked 4264 The Definitive C++ Book Guide and List Related 1Segmentation fault263What is a segmentation fault?52How to speed up g++ compile time (when using a lot of templates)71std::enable_if to conditionally compile Peter Top Ronald W Green (Intel) Tue, 05/03/2011 - 14:20 Peter, I must strongly recommend upgrading Xcode to 3.2.5 or greater along this upgrade of the compiler. As I use bits of test code to see what's happening right before the crash. –user1821626 Nov 13 '12 at 18:07 @user1821626: That would be a compiler error.

But both times I just restarted the build_visit process and it seemed to continue okay. It was running Leopard and now I have Snow Leopard. current community chat Stack Overflow Meta Stack Overflow your communities Sign up or log in to customize your list. get redirected here Please don't fill out this field.

I am sure this error is not a VisIt problem but something else. And which version of Mac OS X. Does anyone know this encoding? Browse other questions tagged c++ arrays templates g++ or ask your own question.

My compiler version is indeed 11.1.089, sorry for the typo. The use of each key in Western music Is foreign stock considered more risky than local stock and why? more stack exchange communities company blog Stack Exchange Inbox Reputation and Badges sign up log in tour help Tour Start here for a quick overview of the site Help Center Detailed Oh and I meant sudo apt-get install --reinstall gcc gcc-4.6 gcc-4.6-base libgcc1 in my previous comment. (there's no such action as apt-get reinstall.) –gertvdijk Jun 26 '13 at 9:36 1

My question comes when I went to move code from an XCode project to a Codeblocks project.

© Copyright 2017 renderq.net. All rights reserved.