Loading...
Home > Internal Compiler > Internal Compiler Error Segmentation Fault

Internal Compiler Error Segmentation Fault

Contents

That's it. Start building. slave-14.10-1 Memory size: 2560MB slave-14.10-2 Memory size: 2560MB #15 Updated by Junxiao Shi almost 2 years ago Job configuration needs to be updated so that projects are built with Ubuntu 14.10 UbuntuCommunityAsk!DeveloperDesignDiscourseHardwareInsightsJujuShopMore ›AppsHelpForumLaunchpadMAASCanonical current community chat Ask Ubuntu Ask Ubuntu Meta your communities Sign up or log in to customize your list. navigate to this website

On what operating system? Although I'm sure you already have it, for rapid perusal, I have attached the source file that caused the seg fault. Related 12g++ and c++0x specification support54C++11 make_pair with specified template parameters doesn't compile16Internal compiler error : segmentation fault with g++4.3.55segmentation fault when moving std::vector3Constructor and initializer_list1g++ Internal compiler error in small I only have 1 accessible computer. http://askubuntu.com/questions/312835/gcc-segmentation-fault-on-ubuntu-12-04

Internal Compiler Error Segmentation Fault Android

Build type: Release (anything that has -O2 or -O3) 4. Word for destroying someone's heart physically How do you grow in a skill when you're the company lead in that area? current community chat Stack Overflow Meta Stack Overflow your communities Sign up or log in to customize your list.

  1. If we could found the minimal input that triggers the problem, we could (1) report a bug to GCC (2) modify the snippet to workaround the bug. #2 Updated by Davide
  2. When is it okay to exceed the absolute maximum rating on a part?
  3. Previous company name is ISIS, how to list on CV?
  4. Why mount doesn't respect option ro What is the meaning of this sentence and why did the Giant rip open his belly?
  5. more stack exchange communities company blog Stack Exchange Inbox Reputation and Badges sign up log in tour help Tour Start here for a quick overview of the site Help Center Detailed

asked 3 years ago viewed 8436 times active 1 year ago Blog Stack Overflow Podcast #91 - Can You Stump Nick Craver? It is the first time I have ever seen an ICE so just wanted to be sure. Are D&D PDFs sold in multiple versions of different quality? What does it stand for? –Matt Clarkson Sep 3 '12 at 17:01 ICE=Internal Compiler Error. –Nordic Mainframe Sep 3 '12 at 19:19 Thanks :) - I figured

On my copy of gcc-4.7.1, this template struct A{}; template using B = const A; B x; is sufficient to give me an ICE. C++: Internal Compiler Error: Segmentation Fault (program Cc1plus) Opencv How to give player the ability to toggle visibility of the wall? Compilation failed Am I doing something outside of the C++ standard here and G++ doesn't have an error message yet? https://gcc.gnu.org/bugzilla/show_bug.cgi?id=57625 See for instructions.

Browse other questions tagged c++ templates gcc c++11 variadic-templates or ask your own question. You'll have to reinstall the plain GCC packages to properly reinstall all gcc binaries. Why was the identity of the Half-Blood Prince important to the story? Try reverting the symbolic link you created and reinstall that package. –gertvdijk Jun 26 '13 at 11:18 | show 3 more comments 1 Answer 1 active oldest votes up vote 4

C++: Internal Compiler Error: Segmentation Fault (program Cc1plus) Opencv

Join them; it only takes a minute: Sign up Here's how it works: Anybody can ask a question Anybody can answer The best answers are voted up and rise to the more stack exchange communities company blog Stack Exchange Inbox Reputation and Badges sign up log in tour help Tour Start here for a quick overview of the site Help Center Detailed Internal Compiler Error Segmentation Fault Android What is the expected output? Libgcc Internal Compiler Error Segmentation Fault Personal Open source Business Explore Sign up Sign in Pricing Blog Support Search GitHub This repository Watch 310 Star 1,938 Fork 594 bulletphysics/bullet3 Code Issues 232 Pull requests 35 Projects

Using wildcards for column names in dynamic soql in apex How should I deal with a difficult group and a DM that doesn't help? useful reference And why? Initially it did not find cc1 so I added a soft link. COLLECT_GCC=gcc COLLECT_LTO_WRAPPER=/usr/libexec/gcc/x86_64-redhat-linux/4.8.2/lto-wrapper Target: x86_64-redhat-linux Configured with: ../configure --prefix=/usr --mandir=/usr/share/man --infodir=/usr/share/info --with-bugurl=http://bugzilla.redhat.com/bugzilla --enable-bootstrap --enable-shared --enable-threads=posix --enable-checking=release --with-system-zlib --enable-__cxa_atexit --disable-libunwind-exceptions --enable-gnu-unique-object --enable-linker-build-id --with-linker-hash-style=gnu --enable-languages=c,c++,objc,obj-c++,java,fortran,ada,go,lto --enable-plugin --enable-initfini-array --enable-java-awt=gtk --disable-dssi --with-java-home=/usr/lib/jvm/java-1.5.0-gcj-1.5.0.0/jre --enable-libgcj-multifile --enable-java-maintainer-mode --with-ecj-jar=/usr/share/java/eclipse-ecj.jar --disable-libjava-multilib Internal Compiler Error Segmentation Fault Please Submit A Full Bug Report

share|improve this answer edited Jun 6 '14 at 10:16 answered Jun 6 '14 at 10:04 Csq 4,20361636 1 But the real issue is still a bug in GCC. Is it ok to turn down a promotion? Thus, total memory on these slaves shall be set to 2560MB, so that there are 1.5GB available memory for compilation, as recommended by the new documentation. #14 Updated by Yi Huang my review here Thanks for clarifying the problem nevertheless. –usr1234567 Jun 6 '14 at 10:05 @user2799037, the real issue is the bug in OP's code, but it does apparently reveal a bug

horizontal alignment of equations across multiple lines Are non-english speakers better protected from (international) Phishing? I tried reinstalling build-essential, but to no avail. Comment 7 Marek Polacek 2015-09-21 13:38:16 UTC Looks resolved then.

Not the answer you're looking for?

mingw32-make.exe[2]: *** [src/BulletCollision/CMakeFiles/BulletCollision.dir/CollisionDispatch/btInternalEdgeUtility.obj] Error 1 mingw32-make.exe[1]: *** [src/BulletCollision/CMakeFiles/BulletCollision.dir/all] Error 2 mingw32-make.exe: *** [all] Error 2 mingw32-make.exe[2]: Leaving directory `D:/DevLibs/bullet-read-only/build-cb' mingw32-make.exe[1]: Leaving directory `D:/DevLibs/bullet-read-only/build-cb' Process terminated with status 2 (1 minute(s), 14 Then I executed compilation command while the memory allocation program is running. It's clear that the problem was undefined behaviour in 4.7.2, not a wrong-code error in 4.8+. How to find positive things in a code review?

With no errors, the compiler returns an internal error Comment 1 blake.fumberger 2013-08-23 03:36:51 UTC reviewing the attached file shows that line 45 wasn't in the correct position. Thanks. See for instructions. http://renderq.net/internal-compiler/internal-compiler-error-segmentation-fault-11-freebsd.php Now those two slaves have total memory of 2560MB.

Sign in to comment Contact GitHub API Training Shop Blog About © 2016 GitHub, Inc. GCC 4.8+ (http://nuwen.net/mingw.html version 10.4 x86 used on Windows OS) 2. Comment 4 Steve Kargl 2013-08-23 04:31:43 UTC On Fri, Aug 23, 2013 at 04:07:07AM +0000, blake.fumberger at gmail dot com wrote: > --- Comment #3 from blake.fumberger at gmail dot com How to add line separators between columns in Latex table?

Reload to refresh your session. Other than that, I have no problems making the change in INSTALL.rst. +1 #11 Updated by Junxiao Shi almost 2 years ago % Done changed from 30 to 70 http://gerrit.named-data.net/1488 #12 more hot questions question feed default about us tour help blog chat data legal privacy policy work here advertising info mobile contact us feedback Technology Life / Arts Culture / Recreation Format For Printing -XML -Clone This Bug -Top of page Home | New | Browse | Search | [?] | Reports | Help | NewAccount | Log In Remember [x] |

Is foreign stock considered more risky than local stock and why? By adjusting the amount of memory allocated, three different error messages are observed: 1536MB: [ 2/174] Compiling src/common-pch.hpp virtual memory exhausted: Cannot allocate memory 1024MB: [ 2/174] Compiling src/common-pch.hpp cc1plus: out Thanks. –Korbi Apr 8 '14 at 11:57 add a comment| 1 Answer 1 active oldest votes up vote -3 down vote The fix is easy: Write a bug report, find out I am unable to reproduce this using the exact same gcc version and the source you provided - binary returns "Hello World!" as expected.

Comment 5 Dominique d'Humieres 2013-09-02 12:44:16 UTC Works also for me on x86_64-apple-darwin10. Comment 2 kargl 2013-08-23 04:01:55 UTC The program compiles with all version of gfortran I have available to me on x86_64-*-freebsd: 4.2.5 20090330 4.3.6 (GCC) 4.4.7 (GCC) 4.5.4 (GCC) 4.6.4 (GCC) Find and display best Poker hand Meaning of grey and yellow/brown colors of buildings in google maps? It should just be there - it's a hard dependency of gcc.

What is the meaning of this sentence and why did the Giant rip open his belly? share|improve this answer answered Apr 4 '14 at 8:52 gnasher729 32k22851 Yes, this would be the easiest way. more stack exchange communities company blog Stack Exchange Inbox Reputation and Badges sign up log in tour help Tour Start here for a quick overview of the site Help Center Detailed Args> struct Container {}; template struct Store {}; int main() { Container a; } //g++ -Wall -std=c++11 main.cpp ideone I'm using gcc 4.8.1 and I get the following error

Plausibility of the Japanese Nekomimi Why do central European nations use the color black as their national colors?

© Copyright 2017 renderq.net. All rights reserved.