Loading...
Home > Internal Compiler > Internal Compiler Error Unity

Internal Compiler Error Unity

Contents

this.Item2.GetHashCode() : 0) ^ ((this.Item3 != null) ? Graham-Dunnett ♦♦ · Dec 05, 2012 at 09:58 AM 1 Share https://store.unity3d.com/products/support. Instead of turning the function off, I looked into the detailed configurations and moved the relevant "Sandboxed Files" and "Uncategrized Files" to "Trusted Files", then it worked. Which brings me to my next point, which is that... navigate to this website

Comment Add comment · Show 3 10 |3000 characters needed characters left characters exceeded ▼ Viewable by all users Viewable by moderators Viewable by moderators and the original poster Advanced visibility output was: Unhandled Exception: System.ArgumentNullException: Argument cannot be null. Related Questions Can someone help me fix my Javascript for Flickering Light? 4 Answers Setting Scroll View Width GUILayout 1 Answer Limit on GUI Components? 0 Answers Quick Question About UnityScript Show more comments 6 Replies · Add your reply Sort: 1 Answer by Venryx · Feb 27, 2014 at 07:44 PM I've been having internal compiler errors in my project also, http://answers.unity3d.com/questions/600237/how-to-solve-internal-compiler-error.html

Unity Internal Compiler Error Unhandled Exception

If that doesn't work, you could try making a proper, "well-defined" delegate instead of a linq expression that the compiler tries to work out the type of. To help users navigate the site we have posted a user guide. Peter Land - What or who am I? Just because you don't understand the error message doesn't make it crap.

  1. Well one nice feature of parse is that it uses Tasks to handle its asynchronicity.
  2. I am running out of time.
  3. I tried the deleting the file under the temp folder but it doesn't fix it.
  4. I managed to simplify the entire problem down to this simple example: public static class TaskHelpers { public static void Then(this Task task, Action> next) { task.ContinueWith(t => { }); }
  5. To help users navigate the site we have posted a user guide.
  6. I am getting Error LeapCSharp.dll Access denied.
  7. this.Item3.GetHashCode() : 0); } public static bool operator ==(Tuple left, Tuple right) { return left.Equals(right); } public static bool operator ==(Tuple left, object right) {
  8. Why mount doesn't respect option ro Farming after the apocalypse: chickens or giant cockroaches?
  9. I then moved the CompileBreaker code to the next file, found the same issue (with it having "partial" class declarations), and fixed it.

For troubleshooting common problems with Unity 5.x Editor (including Win 10). I am guessing it has something to do with the fact that FirstOrDefault is returning something the compiler is not able to resolve properly. share|improve this answer answered Mar 24 '14 at 9:40 SteakOverflow 1,0161229 add a comment| up vote 1 down vote What worked for me was setting the target platform lower(from 4.5 to Internal Compiler Error Segmentation Fault And I think I'm having issues with generics (specifically dictionary), but I'm not sure yet as all I get is an Internal Compiler Error. (It's just beyond belief they didn't update

I searched for many different topics but this is the one who saved me. Unity Internal Compiler Error Access Denied Comment Add comment · Share 10 |3000 characters needed characters left characters exceeded ▼ Viewable by all users Viewable by moderators Viewable by moderators and the original poster Advanced visibility Viewable See the console log for more information. It compiles.

I reverted back to 3.5 and get the exact same internal compiler error. Internal Compiler Error In Push_minipool_fix output was: Unhandled Exception: System.UnauthorizedAccessException: Access to the path "C:\Users\Trevor\Desktop\My Unity Projects\FPS\Temp\Assembly-CSharp-firstpass.dll.mdb" is denied. I do not know how to eliminate it completely, but I know how to make it disappear: In monodevelop you can comment any line that will not cause a compiler error Either AnitVirus software or file permission issues.

Unity Internal Compiler Error Access Denied

Related Questions When I build my game it gives me this error 'Assets/Builds/Build_0.01_Data/Managed/Assembly-CSharp.dll' shouldn't be queried by IsAssemblyCompatible, missing IsInternalOrCompiledAssembly check ? 1 Answer Precompile shader 1 Answer Hi, How can I would also very much know how to eliminate it completely. Unity Internal Compiler Error Unhandled Exception output was: Unhandled Exception: System.UnauthorizedAccessException: Access to the path "C:\Users\Chukwuka\Documents\New Unity Project\Temp\Assembly-CSharp-Editor.dll.mdb" is denied. Unity Internal Compiler Error Dll Related Questions How to find an elusive crash? 2 Answers why is it looking for a , 1 Answer BCE0051: Operator '-' cannot be used with a left hand side type

I replaced it with Norton and have not had problems since. useful reference Witchunter · Sep 22, 2014 at 11:00 PM 0 Share Preinstalled McAfee was causing the exact same issue for me. For future reference im using windows 8.1 x64 and after disabling the above feature and reopening the project was all ok.. And so on. Internal Compiler Error Segmentation Violation Signal Raised

I am getting an Internal Compiler Error. To help users navigate the site we have posted a user guide. more stack exchange communities company blog Stack Exchange Inbox Reputation and Badges sign up log in tour help Tour Start here for a quick overview of the site Help Center Detailed http://renderq.net/internal-compiler/internal-compiler-error-net.php Each time the CompileBreaker code is reached, you know the code up to that point is fine, so you just move it to the bottom of the next file.

Welcome to Unity Answers The best place to ask and answer questions about development with Unity. Internal Compiler Error Killed (program Cc1plus) We are making improvements to UA, see the list of changes. I have created my own Tuple class because it is not in Unity.

Here is what the console.log gave me after I tried to make a script: Internal compiler error.

Related Questions Internal Compiler Error BCE0055 1 Answer Unity suddenly giving internal compiler errors 0 Answers Compiler Warnings Are Now Errors 0 Answers Internal Compiler Error 3 Answers strange error 1 at System.IO.FileStream..ctor (System.String path, FileMode mode, FileAccess access, FileShare share, Int32 bufferSize, Boolean anonymous, FileOptions options) [0x00000] in :0 at System.IO.FileStream..ctor (System.String path, FileMode mode, FileAccess access, FileShare share, Int32 I have experienced other issues that convinced me that version 4 is not production quality yet. Internal Compiler Error Illegal Instruction Welcome to Unity Answers The best place to ask and answer questions about development with Unity.

Comment Add comment · Share 10 |3000 characters needed characters left characters exceeded ▼ Viewable by all users Viewable by moderators Viewable by moderators and the original poster Advanced visibility Viewable B) This made me realize that the internal compiler error must be happening at some specific line in some specific file, and that once it hit that line, it stopped compiling Linked 7 DllNotFoundException in unity3d plugin for c++ dll Related 4Code Stripping Errors Unity0Unity plugin conflict in WP82How can I include SWIG-wrapped C++ in Unity 3D?1Unity3D call external dll3Creating Wp8 Unity get redirected here The stack trace doesn't help me any because I have no idea which of my source files it is working on when the error occurs.

Then, re-open your project and try to compile. For troubleshooting common problems with Unity 5.x Editor (including Win 10). Comment Add comment · Share 10 |3000 characters needed characters left characters exceeded ▼ Viewable by all users Viewable by moderators Viewable by moderators and the original poster Advanced visibility Viewable Follow this Question Answers Answers and Comments 23 People are following this question.

I did a search here and there are a lot of them. It works fine when I launch the game within the editor but if I try to compile I get the following: Internal compiler error. See the console log for more information. It'll happen with brand new projects - not an issue with the code.

Comment Add comment · Show 1 · Share 10 |3000 characters needed characters left characters exceeded ▼ Viewable by all users Viewable by moderators Viewable by moderators and the original poster I just don't know how to solve it. See the console log for more information. It took me quite a while to work out what was going on, but I eventually worked out that if I separated the handler from the Continue With call it would

What happened just before it started? Maybe not? Venryx · Feb 27, 2014 at 10:41 PM 0 Share Yeah, Mono seems to have trouble sometimes with multiple implementations of a function, when one or more of them have generics-based So I guess this is a lesson learnt.

We are making improvements to UA, see the list of changes. I guess you are on windows? To help users navigate the site we have posted a user guide. I have slowly brought over the single classes one at a time, but can't pin down exactly when the internal compiler error triggered because I had brought over several classes and

Moved the CompileBreaker to the next file. Related Questions Internal Compiler Error 0 Answers unknown database error 1 Answer error CS0016 - Access to the path is denied 1 Answer Internal Compiler Error 6 Answers Internal Compiler Error It appears that Generic parameter usage causes the problem when there is a choice of multiple possible implementations. It is defined as follows: using System; namespace System { // This is a very minimalistic implementation of Tuple'2 that allows us // to compile and work on versions of .Net

© Copyright 2017 renderq.net. All rights reserved.