Loading...
Home > Internal Compiler > Internal Compiler Error Virtual Memory Exhausted

Internal Compiler Error Virtual Memory Exhausted

Contents

How to find positive things in a code review? Sign in to comment Contact GitHub API Training Shop Blog About © 2016 GitHub, Inc. Find and display best Poker hand Spaced-out numbers I beat the wall of flesh but the jungle didn't grow restless Heisenberg's Uncertainty Principle Interaction between a predictor and its quadratic form? jarret commented Feb 26, 2016 @rebroad Not yet. navigate to this website

You need to either build with fewer parallel tasks (make -j1) or get more memory. Will they need replacement? The concern was around 1 GB, but this data shows that this can be comfortably mitigated with gcc options or by using clang. GNU software is, as a general philosophy, designed to not impose arbitrarily limit and I presume this is especially true for gcc. http://stackoverflow.com/questions/21577816/cc1plus-virtual-memory-exhausted

Internal Compiler Error Killed (program Cc1plus)

The CPU has been pegged at 100% since starting, and it hasn't crashed yet. Top pierre Posts: 5 Joined: Thursday 15 May 2014 12:35 Target OS: Raspberry Pi Domoticz version: Contact: Contact pierre Send private message Re: problem compile on Raspberry Pi Quote Postby pierre I would like to ask: Is there any source file size limit for qcc? c++ json compiler-errors virtual-memory wt share|improve this question edited Mar 4 '13 at 3:20 asked Mar 4 '13 at 2:20 user1382306 Don't know why someone downvoted you, seems like

  • So the actual expansion happens on internal representations (Gcc Generic) which is more complex than what you imagine (e.g.
  • I don't have a market study, but I am doubtful that the average Pi user is also a native, fluent Linux user on their main machine.
  • A tell-tale sign of this problem is that the CS and DS limit value printed in the crash message is very close to the end of the 4GB address space, like
  • more stack exchange communities company blog Stack Exchange Inbox Reputation and Badges sign up log in tour help Tour Start here for a quick overview of the site Help Center Detailed
  • Also, when I run bitcoind, I get the following error: /usr/lib/arm-linux-gnueabihf/libstdc++.so.6: version `GLIBCXX_3.4.21' not found Bitcoin member laanwj commented Mar 1, 2016 Did you mean the package g++-arm-linux-gnueabi or g++-arm-linux-gnueabihf?
  • So if your system sometimes cannot find files that you know are there, check whether your disk gets proper cooling and generally works okay.
  • If you overclocked the CPU, try resetting it back to its normal speed.
  • laanwj added Docs and Output Resource usage labels Feb 9, 2016 rebroad commented Feb 26, 2016 @jarret did you get your Pi 1 to catch up with the blockchain?

DJGPP programs have a fixed-size stack that is by default 256KB (512KB in DJGPP v2.02 and later). You can then run gdb on the binary to perform some debugging as well. A possible cause for the "Abort!" message is that the TMPDIR environment variable points to a non-writable directory. Increase Swap Space Raspberry Pi You should avoid such constructs in your programs.

Could you give me some suggestions. Internal Compiler Error Gcc Post here your questions when not sure where else to postOnly for bugs in the Domoticz application! make[4]: Entering directory `/home/vagrant/mesos-0.25.0/build/3rdparty/libprocess' /bin/bash ./libtool --tag=CXX --mode=compile g++ -DPACKAGE_NAME=\"libprocess\" -DPACKAGE_TARNAME=\"libprocess\" -DPACKAGE_VERSION=\"0.0.1\" -DPACKAGE_STRING=\"libprocess\ 0.0.1\" -DPACKAGE_BUGREPORT=\"\" -DPACKAGE_URL=\"\" -DPACKAGE=\"libprocess\" -DVERSION=\"0.0.1\" -DSTDC_HEADERS=1 -DHAVE_SYS_TYPES_H=1 -DHAVE_SYS_STAT_H=1 -DHAVE_STDLIB_H=1 -DHAVE_STRING_H=1 -DHAVE_MEMORY_H=1 -DHAVE_STRINGS_H=1 -DHAVE_INTTYPES_H=1 -DHAVE_STDINT_H=1 -DHAVE_UNISTD_H=1 -DHAVE_DLFCN_H=1 -DLT_OBJDIR=\".libs/\" -DHAVE_APR_POOLS_H=1 http://stackoverflow.com/questions/15193585/virtual-memory-exhausted-cannot-allocate-memory Thanks to @luke-jr for the CCFLAGS suggestion in #6658 that seems to solve it - and yes, let's get these added to either the documentation, or automatically set if it's detected

N(e(s(t))) a string more hot questions question feed default about us tour help blog chat data legal privacy policy work here advertising info mobile contact us feedback Technology Life / Arts Add Swap Space Ubuntu Any suggestions to fix virtual memory exhausted problem of cc1plus? Specific word to describe someone who is so good that isn't even considered in say a classification Function creating function, compiled languages equivalent Why do people move their cameras in a More accurately: qcc is a lightweight wrapper that calls gcc; all the real work is done by gcc.

Internal Compiler Error Gcc

asked 3 years ago viewed 11706 times active 1 year ago Blog Stack Overflow Podcast #91 - Can You Stump Nick Craver? MAVLink Micro Air Vehicle Protocol member vooon commented Dec 10, 2015 I recommend to forgot all that rosbuild & catkin_make crap. Internal Compiler Error Killed (program Cc1plus) Since this is future-looking, this may not warrant this issue remaining open, but it is worth discussing and monitoring going forward. 3) The '--disable-tests' option doesn't reduce memory use. Gcc Internal Compiler Error Segmentation Fault c++ qnx momentics share|improve this question asked Feb 5 '14 at 12:50 wojakzek 17616 1 That's a massive file!!!

Hide Permalink Steven Fisher added a comment - 28/Oct/15 09:13 Ok, I tried again on the RPi and just set up a cross compilation environment on my Mac. useful reference It works for N=10000 so it looks like it is using O(N^2) space somehow, but it should only be using O(NlogN) space. –Andrew Tomazos Oct 27 '12 at 21:32 WApplication is for an interactive user interface. j> struct C, F> : F { using T = F; }; template struct S : C::T, typename S::T> {}; template<> struct S<1> : F<0> { using Gcc Internal Compiler Error Killed (program Cc1)

make[2]: *** [CMakeFiles/mavros.dir/src/lib/uas_data.cpp.o] Error 4 make[1]: *** [CMakeFiles/mavros.dir/all] Error 2 make: *** [all] Error 2 <== Failed to process package 'mavros': Command '['/home/odroid/skywalker/devel_isolated/mavros_msgs/env.sh', 'make', '-j8', '-l8']' returned non-zero exit status 2 bugs) can also cause GCC to print "Abort!". Q: During compilation, GCC prints "Fatal: Error in DJGPP installation. my review here Pages: [1] Print Bitcoin Forum>Bitcoin>Technical Support (Moderator: achow101)>[SOLVED] g++: internal compiler error: Killed (program cc1plus) « previous topic next topic » Jump to: Please select a destination: -----------------------------

Old releases of CWSDPMI could fail like this if an application asks for a large number of small memory chunks. Swapon Failed: Operation Not Permitted Reload to refresh your session. Here's the original source to the hello world file.

Beginning with version 2.8.1, GCC refuses to work when the DJGPP variable doesn't point to the actual path name of a valid DJGPP.ENV file, because GCC uses the value of the

Join them; it only takes a minute: Sign up C++11: g++-4.7 internal compiler error up vote 9 down vote favorite 2 The following code: #include #include using namespace std; I'd say this question is not relevant to your case because you already stated you don't have control over the generated code. laanwj referenced this issue Feb 5, 2016 Closed Depends system needs to figure more prominently in build docs #7473 jarret commented Feb 5, 2016 Do you know of any plans to Increase Swap Space Ubuntu Good luck with this ... +1. –Ben Mar 4 '13 at 2:24 4 First thing I'd try is run the program under valgrind to see if it finds any memory

I reinstall mavros and mavlink on the odroid and setup environments. It may be worded ackwardsly but the gcc tweaking is already necessary when compiling with 1 GB of memory. 512MB is no-chance territory. Another rare case of crashes in GCC was reported on Windows 3.X. get redirected here One user reported that he had random crashes and seemingly-missing files due to a disk without proper cooling.

Also, when I run bitcoind, I get the following error: /usr/lib/arm-linux-gnueabihf/libstdc++.so.6: version `GLIBCXX_3.4.21' not found Using the same configure options as gitian may solve that: ./configure --enable-glibc-back-compat --enable-reduce-exports LDFLAGS=-static-libstdc++ Bitcoin member The script you reference is doing make -j $(($(num_cores)*2)) . Which are probably all that run bitcoind in the first place. Browse other questions tagged c++ linux gcc c++11 g++ or ask your own question.

Can an umlaut be written as line (when writing by hand)? Using wildcards for column names in dynamic soql in apex Why was the identity of the Half-Blood Prince important to the story? A1: qcc = gcc. The outcome was the same: Basically, it looks like I need to submit a compiler bug report to move forwards.

Atlassian Unfortunately, this 64-bit suggestion almost surely does not apply to the gcc version that QNX shipped with 6.4.1. Show James Peach added a comment - 27/Oct/15 16:31 gcc ran out of memory. Flour shortage in baking What are cell phone lots at US airports for?

Linked 0 Virtual memory issue with QtCreator 1 gcc module size limits Related 834When to use virtual destructors?2GCC virtual memory exhausted: Permission denied6virtual memory exhausted: Cannot allocate memory1MSXML causes virtual memory jarret commented Feb 6, 2016 I am not tied to the wording in the docs, so don't avoid changing it on my account. Deals & bargains Forum feedback Show your projects Projects on other sites Who is online Users browsing this forum: No registered users and 3 guests Board index Trial 6 - GCC tuned with aggressive ggc-min-expand and ggc-min-heapsize $ ./configure --with-incompatible-bdb CXXFLAGS=" --param ggc-min-expand=0 --param ggc-min-heapsize=4096" Time Pi 1 Pi 2 VM real FAIL FAIL FAIL user FAIL FAIL

Re: [SOLVED] g++: internal compiler error: Killed (program cc1plus) October 23, 2014, 04:23:47 AM  #9 Quote from: GoldSeal on June 18, 2014, 06:20:18 AMI had the same problem ona digital ocean How to DM a no-equipment start when one character needs something specific? If you don't set TMPDIR from your AUTOEXEC.BAT or from the DOS prompt, the DJGPP startup code sets it to the tmp subdirectory of the main DJGPP installation directory. You could also use a cross-compile toolchain (I haven't tested that Mesos can cross-build but it is well supported by automake).

This one is an autogenerated code from a large Matlab/SIMULINK simulation model so it is not easy to divide and conquer. The fix was to do the following:Code:freedd if=/dev/zero of=/var/swap.img bs=1024k count=1000mkswap /var/swap.imgswapon /var/swap.imgfreemake -f makefile.unixRegardless of what the first poster said.

© Copyright 2017 renderq.net. All rights reserved.