Loading...
Home > Windows 10 > Install Wizard Error

Install Wizard Error

Contents

Node.js Foundation member joaocgreis commented Mar 24, 2016 They are used by node, newer and older versions. After I had deleted this entry, node installation passed fine. joaocgreis referenced this issue May 3, 2016 Closed NodeJS install problem - Error 1603 #6547 yogibear54 commented May 17, 2016 @ilkercat thanks! This just means that one of the files is in use by a program right now. http://renderq.net/windows-10/install-shield-wizard-error.php

The Temp folder will open.5. by Kees Bakker / January 12, 2005 10:07 PM PST In reply to: InstallShield Wizard not allowing installation Lot's of troublesome interfering factors absent then. it is an extensible software management system. See why it earned our Editors' Choice award. https://support.microsoft.com/en-us/kb/910816

1607 Unable To Install Installshield Scripting Runtime Windows 7

Please refer to our CNET Forums policies for details. permalinkembedsaveparentgive gold[–]SuperRitzFernando[S] 0 points1 point2 points 8 months ago(0 children)Nah man, it didn't work! :( permalinkembedsaveparentgive gold[–]v3r50n 0 points1 point2 points 8 months ago(0 children)Got the beta and have the same issue as well. So, I install Super repo to get the addons I want for now.

  1. Hope this helps.Kees Flag Permalink This was helpful (0) Back to Computer Help forum 3 total posts Popular Forums icon Computer Help 51,912 discussions icon Computer Newbies 10,498 discussions icon Laptops
  2. Personal Open source Business Explore Sign up Sign in Pricing Blog Support Search GitHub This repository Watch 1,901 Star 27,835 Fork 4,596 nodejs/node Code Issues 576 Pull requests 276 Projects
  3. I was attempting to do a per-user install of v4.6.0 on 64-bit (Windows) - "Microsoft Windows 7 Professional 6.1.7601 Service Pack 1 Build 7601" via msiexec /I node-v4.6.0-x64.msi ALLUSERS=2 MSIINSTALLPERUSER=1 I
  4. Once reported, our moderators will be notified and the post will be reviewed.
  5. Windows 10 64 bit permalinkembedsavegive gold[–]CptNicka 0 points1 point2 points 7 months ago(2 children)same thing man i really want to paladins but it doesnt work :( permalinkembedsavegive gold[–]SuperRitzFernando[S] 0 points1 point2 points 7 months ago(0

There was an older version of nodejs on my machine installed before. Be advised however as discussed in the article [Q872903], errors occurs when the SYSTEM account on the particular drive does not have correct permissions. Also please exercise your best judgment when posting in the forums--revealing personal information such as your e-mail address, telephone number, and address is not recommended. 1628 Failed To Complete Installation Windows 10 Microsoft Direct X End- User Runtime Web Installer -http://www.microsoft.com/download/en/details.aspx?id=35 6.

The root cause for this may be wixtoolset/issues#4462/ . Installshield 1628 Failed To Complete Installation Type %temp% then click OK4. The system returned: (22) Invalid argument The remote host or network may be down. http://answers.microsoft.com/en-us/windows/forum/windows_7-windows_programs/receiving-error-message-installshield-wizard-not/7734b798-f809-4494-a52f-1f9d2b34da26 shenmiweiyi commented Oct 17, 2016 I was facing same issue on windows7 64 bit machine.This is my installing log.I try to many ways and still didn't fix the issue.Please help me

Microsoft Visual C++ 2010 Redistributable Package -http://www.microsoft.com/download/en/details.aspx?id=5555 5. Error 1607 Fsx Windows_NT 10.0.10240 npm ERR! Generated Wed, 19 Oct 2016 00:32:20 GMT by s_wx1011 (squid/3.5.20) {{offlineMessage}} Store Store home Devices Microsoft Surface PCs & tablets Xbox Virtual reality Accessories Windows phone Software Office Windows Additional software code MODULE_NOT_FOUND npm ERR!

Installshield 1628 Failed To Complete Installation

Any help to spare, friends?

As a workaround, if uninstalling first does not work, can you try to install without the "Performance counters" feature (remove under "Node.js runtime" during installation)? 👍 6 🎉 3 samarthRT 1607 Unable To Install Installshield Scripting Runtime Windows 7 it records errors and events in its own error log and in the "Event log" which may be of help to understand the cause of a failed installation.Note: The article [Q328005] 1607 Unable To Install Installshield Scripting Runtime Windows 10 Not sure quite where your error is - interesting that it's happening on all versions.

Thank you for helping us maintain CNET's great community. navigate to this website SIGN UP FOR THE GAME HERE JOIN OUR DISCORD CHAT JOIN OUR STEAM GROUP OUR RULES FAQ Paladins Community Chatrooms IRC Link /r/Paladins on Discord /r/Paladins on Steam Websites Official Website These are : node-v5.2.0-x64.msi node-v4.2.3-x64.msi node-v0.12.7-x64.msi NTVS 1.1 VS 2015.msi Attached is installation log file. npm ERR! Installshield Error 1628

Disruptive posting: Flaming or offending other usersIllegal activities: Promote cracked software, or other illegal contentOffensive: Sexually explicit or offensive languageSpam: Advertisements or commercial links Submit report Cancel report Track this discussion Create a new short cut on your desktop. All rights reserved. http://renderq.net/windows-10/installshield-wizard-error.php In the meantime I also found another issue #524 regarding the same.

However, installing without the "Performance Counter" feature does the job. Installshield Error 1607 Windows 7 Microsoft DirectX End-User Runtimes (June 2010) -http://www.microsoft.com/en-us/download/details.aspx?id=8109 Restart your computer after downloading and installing the latest windows updates and for any changes to take effect.Access the order email confirmation sent to Unselecting the "performance counter" during the installation did the job for me, but I have run the req queries which you provided and got a result for the second one: C:\Windows\system32>reg

Learn more You're viewing YouTube in Russian.

Empty your temporary folder. Discussion is locked Flag Permalink You are posting a reply to: InstallShield Wizard not allowing installation The posting of advertisements, profanity, or personal attacks is prohibited. Please include the following file with any support request: npm ERR! 1607 Error Windows 10 Follow these steps:***For Windows XP1.

Related articles CorelDRAW Technical Suite X7 Update 3 - Lattice3D cannot be activated Pinnacle Studio 19 – Patch Update is now available Next button is greyed out on End User License Sorry, there was a problem flagging this post. I didn't found any previous versions installed on the system. click site Before downloading and installing the program please delete Windows Temporary Files.

When I try to execute the instalation setup, I get a notification to allow it to continue, After I click Yes, an error pops up saying: "An error (-5001 : 0x80070002) Connect with us facebook twitter CNET Reviews Top Categories CNET 100 Appliances Audio Cameras Cars Desktops Drones Headphones Laptops Networking Phones Printers Smart Home Software Tablets TVs Virtual Reality Wearable Tech

© Copyright 2017 renderq.net. All rights reserved.